BDBM50237040 CHEMBL4088405
SMILES Fc1cnc(nc1N(Cc1ccc2OCOc2c1)c1ccc(OCC2CC2)cc1)C#N
InChI Key InChIKey=HBUHNZBRIJOLPO-UHFFFAOYSA-N
Data  1 KI
  Tab Delimited (TSV)   2D SDfile   Computed 3D by Vconf -m prep SDfile
Find this compound or compounds like it in BindingDB:
Activity Spreadsheet -- Enzyme Inhibition Constant Data from BindingDB
Found 1 hit for monomerid = 50237040
TargetProcathepsin L(Homo sapiens (Human))
Roche Pharmaceutical Research And Early Development (Pred)
Curated by ChEMBL
LigandPNGBDBM50237040(CHEMBL4088405)
Affinity DataKi: >5.10E+3nM. Assay description: Inhibitory concentration against Trypanosoma mexicana glyceraldehyde-3-phosphate dehydrogenase (GAPDH)
In DepthDetails ArticlePubMed