BDBM50237044 CHEMBL4075354
SMILES Fc1cnc(nc1N(Cc1ccc2OCOc2c1)c1ccccc1)C#N
InChI Key InChIKey=MNPXLVXWJKVYMR-UHFFFAOYSA-N
Data  1 KI
  Tab Delimited (TSV)   2D SDfile   Computed 3D by Vconf -m prep SDfile
Find this compound or compounds like it in BindingDB:
Activity Spreadsheet -- Enzyme Inhibition Constant Data from BindingDB
Found 1 hit for monomerid = 50237044
TargetProcathepsin L(Homo sapiens (Human))
Roche Pharmaceutical Research And Early Development (Pred)
Curated by ChEMBL
LigandPNGBDBM50237044(CHEMBL4075354)
Affinity DataKi:  1.80E+3nM. Assay description: Inhibition of human Cathepsin L by fluorescence assay based Cheng-Prusoff equation analysis
In DepthDetails ArticlePubMed