BDBM50237864 CHEMBL404747::N-(5-(2-oxopyrrolidin-1-yl)-1H-indazol-3-yl)-2-phenylacetamide
SMILES O=C(Cc1ccccc1)Nc1n[nH]c2ccc(cc12)N1CCCC1=O
InChI Key InChIKey=UXNFEAZGNVZCSX-UHFFFAOYSA-N
Data  1 IC50
  Tab Delimited (TSV)   2D SDfile   Computed 3D by Vconf -m prep SDfile
Find this compound or compounds like it in BindingDB:
Activity Spreadsheet -- Enzyme Inhibition Constant Data from BindingDB
Found 1 hit for monomerid = 50237864
TargetCyclin-dependent kinase 2(Homo sapiens (Human))
Keimyung University
Curated by ChEMBL
LigandPNGBDBM50237864(CHEMBL404747 | N-(5-(2-oxopyrrolidin-1-yl)-1H-inda...)
Affinity DataIC50:  170nM. Assay description: Inhibition of CDK2
In DepthDetails ArticlePubMed