BDBM50239170 CHEMBL4096571
SMILES Fc1ccc2[nH]cc(Cc3c[nH]c4ccc(F)c(F)c34)c2c1F
InChI Key InChIKey=LDRUIKJRACNPMH-UHFFFAOYSA-N
Data  3 EC50
  Tab Delimited (TSV)   2D SDfile   Computed 3D by Vconf -m prep SDfile
Find this compound or compounds like it in BindingDB:
Activity Spreadsheet -- Enzyme Inhibition Constant Data from BindingDB
Found 3 hits for monomerid = 50239170
TargetG-protein coupled receptor 84(Homo sapiens (Human))
University Of Bonn
Curated by ChEMBL
LigandPNGBDBM50239170(CHEMBL4096571)
Affinity DataEC50:  377nM. Assay description: Agonist activity at Gi coupled human GPR84 expressed in CHO cells assessed as inhibition of forskolin-induced cAMP accumulation after 15 mins in pres...
In DepthDetails ArticlePubMed
TargetG-protein coupled receptor 84(Homo sapiens (Human))
University Of Bonn
Curated by ChEMBL
LigandPNGBDBM50239170(CHEMBL4096571)
Affinity DataEC50:  84nM. Assay description: Positive allosteric modulation of recombinant human GPR84 expressed in CHO cell membranes co-expressing beta-arrestin2 assessed as increase in [3H]PS...
In DepthDetails ArticlePubMed
TargetG-protein coupled receptor 84(Homo sapiens (Human))
University Of Bonn
Curated by ChEMBL
LigandPNGBDBM50239170(CHEMBL4096571)
Affinity DataEC50: >1.00E+4nM. Assay description: Agonist activity at human GPR84 expressed in CHO cells assessed as beta-arrestin recruitment after 90 mins by beta-galactosidase complementation assa...
In DepthDetails ArticlePubMed