BDBM50239371 Atnaa::CHEBI:8354::Duodote::Pralidoxime
SMILES C[n+]1ccccc1C=NO
InChI Key InChIKey=JBKPUQTUERUYQE-UHFFFAOYSA-O
Data  2 IC50  1 Kd
  Tab Delimited (TSV)   2D SDfile   Computed 3D by Vconf -m prep SDfile
Find this compound or compounds like it in BindingDB:
Activity Spreadsheet -- Enzyme Inhibition Constant Data from BindingDB
Found 2 hits for monomerid = 50239371
TargetAcetylcholinesterase(Homo sapiens (Human))
Institut De Recherche Biom£Dicale Des Arm£Es
Curated by ChEMBL
LigandPNGBDBM50239371(Atnaa | CHEBI:8354 | Duodote | Pralidoxime)
Affinity DataIC50:  5.60E+5nM. Assay description: Inhibition of recombinant His-TEV-tagged human AChE expressed in CHO-K1 cells using acetylthiocholine iodide as substrate measured for 6 mins by Ellm...
In DepthDetails ArticlePubMed
TargetAcetylcholinesterase(Homo sapiens (Human))
Institut De Recherche Biom£Dicale Des Arm£Es
Curated by ChEMBL
LigandPNGBDBM50239371(Atnaa | CHEBI:8354 | Duodote | Pralidoxime)
Affinity DataKd:  1.40E+5nM. Assay description: Reactivation of POX-inhibited human recombinant AChE assessed as dissociation rate constant using ATC as substrate incubated for 60 mins followed by ...
In DepthDetails ArticlePubMed