BDBM50239384 CHEMBL4063749
SMILES ON(C=O)C(CCCc1ncccn1)CS(=O)(=O)N1CCN(CC1)c1ccc(F)cc1
InChI Key InChIKey=IIQICFFMXDTZPU-UHFFFAOYSA-N
Data  1 IC50
  Tab Delimited (TSV)   2D SDfile   Computed 3D by Vconf -m prep SDfile
Find this compound or compounds like it in BindingDB:
Activity Spreadsheet -- Enzyme Inhibition Constant Data from BindingDB
Found 1 hit for monomerid = 50239384
TargetBile salt export pump(Homo sapiens (Human))
Astrazeneca
Curated by ChEMBL
LigandPNGBDBM50239384(CHEMBL4063749)
Affinity DataIC50: <1.64E+4nM. Assay description: Ability to inhibit HMG-CoA reductase (HMGR) by CoA reductase inhibition screen (COR) in rats
In DepthDetails ArticlePubMed