BDBM50239966 Bretylium::CHEBI:3172
SMILES CC[N+](C)(C)Cc1ccccc1Br
InChI Key InChIKey=AAQOQKQBGPPFNS-UHFFFAOYSA-N
Data  1 IC50
  Tab Delimited (TSV)   2D SDfile   Computed 3D by Vconf -m prep SDfile
Find this compound or compounds like it in BindingDB:
Activity Spreadsheet -- Enzyme Inhibition Constant Data from BindingDB
Found 1 hit for monomerid = 50239966
TargetBile salt export pump(Homo sapiens (Human))
Astrazeneca
Curated by ChEMBL
LigandPNGBDBM50239966(Bretylium | CHEBI:3172)
Affinity DataIC50: >1.00E+6nM. Assay description: Ability to inhibit HMG-CoA reductase (HMGR) by cholesterol synthesis inhibition screen (CSI) in rats
In DepthDetails ArticlePubMed