BDBM50240331 CHEMBL4095102
SMILES Nc1ncc(cn1)-c1cn2c3CN(Cc4ccc(F)cc4)CCc3nc2c(n1)N1CCOCC1
InChI Key InChIKey=VZQMWTRMDBGERH-UHFFFAOYSA-N
Data  1 IC50
  Tab Delimited (TSV)   2D SDfile   Computed 3D by Vconf -m prep SDfile
Find this compound or compounds like it in BindingDB:
Activity Spreadsheet -- Enzyme Inhibition Constant Data from BindingDB
Found 1 hit for monomerid = 50240331
TargetPhosphatidylinositol 3-kinase regulatory subunit alpha/4,5-bisphosphate 3-kinase catalytic subunit alpha isoform(Homo sapiens (Human))
Spanish National Cancer Research Centre (Cnio)
Curated by ChEMBL
LigandPNGBDBM50240331(CHEMBL4095102)
Affinity DataIC50:  12nM. Assay description: Inhibition of full-length human p110alpha (1 to 1068 end residues)/N-terminal GST-tagged p85alpha (1 to 724 end residues) expressed in baculovirus ex...
In DepthDetails ArticlePubMed