BDBM50240335 CHEMBL4105149
SMILES CC(=O)N1CCc2c(C1)nc1c(nc(cn21)-c1cnc(N)nc1)N1CCOCC1
InChI Key InChIKey=HFFMOOODCGRSAX-UHFFFAOYSA-N
Data  1 IC50
  Tab Delimited (TSV)   2D SDfile   Computed 3D by Vconf -m prep SDfile
Find this compound or compounds like it in BindingDB:
Activity Spreadsheet -- Enzyme Inhibition Constant Data from BindingDB
Found 1 hit for monomerid = 50240335
TargetPhosphatidylinositol 3-kinase regulatory subunit alpha/4,5-bisphosphate 3-kinase catalytic subunit alpha isoform(Homo sapiens (Human))
Spanish National Cancer Research Centre (Cnio)
Curated by ChEMBL
LigandPNGBDBM50240335(CHEMBL4105149)
Affinity DataIC50:  13nM. Assay description: Inhibition of full-length human p110alpha (1 to 1068 end residues)/N-terminal GST-tagged p85alpha (1 to 724 end residues) expressed in baculovirus ex...
In DepthDetails ArticlePubMed