BDBM50240481 CHEMBL42934::N-((7R,8R)-8-(4-butylphenylsulfonamido)-7-hydroxy-5,6,7,8-tetrahydronaphthalen-2-yl)-3-methoxybenzamide::N-[8-(4-Butyl-benzenesulfonylamino)-7-hydroxy-5,6,7,8-tetrahydro-naphthalen-2-yl]-3-methoxy-benzamide
SMILES CCCCc1ccc(cc1)S(=O)(=O)N[C@H]1[C@H](O)CCc2ccc(NC(=O)c3cccc(OC)c3)cc12
InChI Key InChIKey=MSRRYBQJYUJDTE-KAYWLYCHSA-N
Data  1 IC50
  Tab Delimited (TSV)   2D SDfile   Computed 3D by Vconf -m prep SDfile
Find this compound or compounds like it in BindingDB:
Activity Spreadsheet -- Enzyme Inhibition Constant Data from BindingDB
Found 1 hit for monomerid = 50240481
TargetPotassium voltage-gated channel subfamily A member 5(Homo sapiens (Human))
Icagen
Curated by ChEMBL
LigandPNGBDBM50240481(CHEMBL42934 | N-((7R,8R)-8-(4-butylphenylsulfonami...)
Affinity DataIC50:  140nM. Assay description: Inhibition of human Kv1.5 channel expressed in mouse L929 cells by patch-clamp electrophysiology method
In DepthDetails ArticlePubMed