BDBM50240864 CHEMBL4079486
SMILES COc1ccn2c(c1)nc1n(Cc3ccccc3)c(=O)n(CC=C)c(=O)c21
InChI Key InChIKey=CSMWAOBOWKBYML-UHFFFAOYSA-N
Data  2 KI
  Tab Delimited (TSV)   2D SDfile   Computed 3D by Vconf -m prep SDfile
Find this compound or compounds like it in BindingDB:
Activity Spreadsheet -- Enzyme Inhibition Constant Data from BindingDB
Found 2 hits for monomerid = 50240864
TargetAdenosine receptor A3(Homo sapiens (Human))
Leiden University
Curated by ChEMBL
LigandPNGBDBM50240864(CHEMBL4079486)
Affinity DataKi:  5.90nM. Assay description: Displacement of [3H]PSB-11 from human adenosine A3 receptor expressed on CHO cell membranes after 2 hrs by scintillation spectrometry
In DepthDetails ArticlePubMed
TargetAdenosine receptor A3(Homo sapiens (Human))
Leiden University
Curated by ChEMBL
LigandPNGBDBM50240864(CHEMBL4079486)
Affinity DataKi:  5.90nM. Assay description: Displacement of [3H]PSB-11 from human adenosine A3 receptor expressed on CHO cell membranes after 2 hrs by scintillation spectrometry
In DepthDetails ArticlePubMed