BDBM50240987 CHEMBL4062723
SMILES FC(F)(F)c1cc(Br)ncc1-c1nc(nc(n1)N1CCOCC1)N1CCOCC1
InChI Key InChIKey=NVKSPLMJOBBCPQ-UHFFFAOYSA-N
Data  1 KI
  Tab Delimited (TSV)   2D SDfile   Computed 3D by Vconf -m prep SDfile
Find this compound or compounds like it in BindingDB:
Activity Spreadsheet -- Enzyme Inhibition Constant Data from BindingDB
Found 1 hit for monomerid = 50240987
TargetSerine/threonine-protein kinase mTOR(Homo sapiens (Human))
University Of Basel
Curated by ChEMBL
LigandPNGBDBM50240987(CHEMBL4062723)
Affinity DataKi:  6.60E+5nM. Assay description: Displacement of [3H]baclofen from gamma-aminobutyric-acid B receptor
In DepthDetails ArticlePubMed