BDBM50242265 CHEMBL4078112
SMILES CCC[C@H](N[C@@H](CCc1ccccc1)C(O)=O)C(=O)N1C[C@H](C[C@H]1C(O)=O)NC(=O)C[C@H](N)Cc1cc(F)c(F)cc1F
InChI Key InChIKey=HTEXKUKUMOZCFK-IDSXKDCHSA-N
Data  12 IC50
  Tab Delimited (TSV)   2D SDfile   Computed 3D by Vconf -m prep SDfile
Find this compound or compounds like it in BindingDB:
Activity Spreadsheet -- Enzyme Inhibition Constant Data from BindingDB
Found 12 hits for monomerid = 50242265
TargetDipeptidyl peptidase 2(Homo sapiens (Human))
Ranbaxy Laboratories
Curated by ChEMBL
LigandPNGBDBM50242265(CHEMBL4078112)
Affinity DataIC50: >1.00E+5nM. Assay description: Inhibition of DPP2 (unknown origin)
In DepthDetails ArticlePubMed
TargetNeprilysin(Homo sapiens (Human))
Ranbaxy Laboratories
Curated by ChEMBL
LigandPNGBDBM50242265(CHEMBL4078112)
Affinity DataIC50: >1.00E+5nM. Assay description: Inhibition of NEP (unknown origin)
In DepthDetails ArticlePubMed
TargetDipeptidyl peptidase 4(Rattus norvegicus (rat))
Ranbaxy Laboratories
Curated by ChEMBL
LigandPNGBDBM50242265(CHEMBL4078112)
Affinity DataIC50:  1.23E+3nM. Assay description: Inhibition of Wistar rat plasma DPP4
In DepthDetails ArticlePubMed
TargetDipeptidyl peptidase 4(Mus musculus)
Ranbaxy Laboratories
Curated by ChEMBL
LigandPNGBDBM50242265(CHEMBL4078112)
Affinity DataIC50:  2.47E+3nM. Assay description: Inhibition of ob/ob mouse plasma DPP4
In DepthDetails ArticlePubMed
TargetDipeptidyl peptidase 4(Homo sapiens (Human))
Ranbaxy Laboratories
Curated by ChEMBL
LigandPNGBDBM50242265(CHEMBL4078112)
Affinity DataIC50:  67nM. Assay description: Inhibition of human plasma DPP4
In DepthDetails ArticlePubMed
TargetDipeptidyl peptidase 9(Homo sapiens (Human))
Ranbaxy Laboratories
Curated by ChEMBL
LigandPNGBDBM50242265(CHEMBL4078112)
Affinity DataIC50: >1.00E+5nM. Assay description: Inhibition of DPP9 (unknown origin)
In DepthDetails ArticlePubMed
TargetAngiotensin-converting enzyme(Homo sapiens (Human))
Ranbaxy Laboratories
Curated by ChEMBL
LigandPNGBDBM50242265(CHEMBL4078112)
Affinity DataIC50:  51nM. Assay description: Inhibitory activity against human renin inhibition (at pH 7.4)
In DepthDetails ArticlePubMed
TargetDipeptidyl peptidase 8(Homo sapiens (Human))
Ranbaxy Laboratories
Curated by ChEMBL
LigandPNGBDBM50242265(CHEMBL4078112)
Affinity DataIC50:  5.70E+4nM. Assay description: Inhibition of DPP8 (unknown origin)
In DepthDetails ArticlePubMed
TargetProlyl endopeptidase(Homo sapiens (Human))
Ranbaxy Laboratories
Curated by ChEMBL
LigandPNGBDBM50242265(CHEMBL4078112)
Affinity DataIC50: >1.00E+5nM. Assay description: Compound was tested in vitro for binding affinity against human carbonic anhydrase II; (ki*10e-9)
In DepthDetails ArticlePubMed
TargetAminopeptidase N(Homo sapiens (Human))
Ranbaxy Laboratories
Curated by ChEMBL
LigandPNGBDBM50242265(CHEMBL4078112)
Affinity DataIC50: >1.00E+5nM. Assay description: Inhibition of APN (unknown origin)
In DepthDetails ArticlePubMed
TargetAngiotensin-converting enzyme(Mus musculus)
Ranbaxy Laboratories
Curated by ChEMBL
LigandPNGBDBM50242265(CHEMBL4078112)
Affinity DataIC50:  2.02E+3nM. Assay description: Inhibition of ob/ob mouse plasma ACE
In DepthDetails ArticlePubMed
TargetAngiotensin-converting enzyme(Rattus norvegicus)
Ranbaxy Laboratories
Curated by ChEMBL
LigandPNGBDBM50242265(CHEMBL4078112)
Affinity DataIC50:  893nM. Assay description: Inhibition of Wistar rat plasma ACE
In DepthDetails ArticlePubMed