BDBM50242272 6-O-alpha-rhamnopyranosyl-DMJ::CHEMBL469655
SMILES C[C@H]1O[C@H](OC[C@H]2NC[C@@H](O)[C@@H](O)[C@@H]2O)[C@@H](O)[C@@H](O)[C@@H]1O
InChI Key InChIKey=PESKMWOASBCMRV-JGLDSSSWSA-N
Data  1 KI
  Tab Delimited (TSV)   2D SDfile   Computed 3D by Vconf -m prep SDfile
Find this compound or compounds like it in BindingDB:
Activity Spreadsheet -- Enzyme Inhibition Constant Data from BindingDB
Found 1 hit for monomerid = 50242272
TargetTissue alpha-L-fucosidase(Bos taurus)
Hokuriku University
Curated by ChEMBL
LigandPNGBDBM50242272(6-O-alpha-rhamnopyranosyl-DMJ | CHEMBL469655)
Affinity DataKi:  60nM. Assay description: Inhibition of bovine epididymis alpha-L-fucosidase assessed as p-nitrophenol release by spectrophotometrically
In DepthDetails ArticlePubMed