BDBM50242424 CHEMBL339359
SMILES CN(CCOc1ccc(CC2SC(=O)NC2=O)cc1)c1nc2ccccc2s1
InChI Key InChIKey=ZOSMLZOMKXVTCW-UHFFFAOYSA-N
Data  1 IC50  1 EC50
  Tab Delimited (TSV)   2D SDfile   Computed 3D by Vconf -m prep SDfile
Find this compound or compounds like it in BindingDB:
Activity Spreadsheet -- Enzyme Inhibition Constant Data from BindingDB
Found 2 hits for monomerid = 50242424
TargetPeroxisome proliferator-activated receptor gamma(Homo sapiens (Human))
The University Of Tokyo
Curated by ChEMBL
LigandPNGBDBM50242424(CHEMBL339359)
Affinity DataIC50:  2.00E+4nM. Assay description: Transrepression activity at human PPARgamma expressed in HEK293 cells assessed as inhibition of TNFalpha induced NF-kappaB promoter activity pretreat...
In DepthDetails ArticlePubMed
TargetPeroxisome proliferator-activated receptor gamma(Homo sapiens (Human))
The University Of Tokyo
Curated by ChEMBL
LigandPNGBDBM50242424(CHEMBL339359)
Affinity DataEC50:  57nM. Assay description: Transactivation activity at Gal4 fused full length human PPARgamma LBD expressed in HEK293 cells after 24 hrs by luciferase reporter gene assay
In DepthDetails ArticlePubMed