BDBM50243983 CHEMBL4086198
SMILES COc1ccc(F)c(c1)-c1ccc(Cc2ccc(cc2)N2N=C([C@@H](C)[C@@H]2CC(O)=O)C(F)(F)F)c(C)c1
InChI Key InChIKey=IBDOODOEDXIXTC-GKVSMKOHSA-N
Data  1 EC50
  Tab Delimited (TSV)   2D SDfile   Computed 3D by Vconf -m prep SDfile
Find this compound or compounds like it in BindingDB:
Activity Spreadsheet -- Enzyme Inhibition Constant Data from BindingDB
Found 1 hit for monomerid = 50243983
TargetPeroxisome proliferator-activated receptor gamma(Homo sapiens (Human))
Bristol-Myers Squibb
Curated by ChEMBL
LigandPNGBDBM50243983(CHEMBL4086198)
Affinity DataEC50:  2.60E+3nM. Assay description: Agonist activity at PPARgamma (unknown origin)
In DepthDetails ArticlePubMed