BDBM50243997 CHEMBL4092937
SMILES CCc1ccc(F)c(c1)N1CCC(CC1)Oc1ccc(cc1)N1N=C([C@@H](C)[C@@H]1CC(O)=O)C(F)(F)F
InChI Key InChIKey=WDNGSOMEBLSPOB-AOMKIAJQSA-N
Data  1 EC50
  Tab Delimited (TSV)   2D SDfile   Computed 3D by Vconf -m prep SDfile
Find this compound or compounds like it in BindingDB:
Activity Spreadsheet -- Enzyme Inhibition Constant Data from BindingDB
Found 1 hit for monomerid = 50243997
TargetFree fatty acid receptor 1(Homo sapiens (Human))
Bristol-Myers Squibb
Curated by ChEMBL
LigandPNGBDBM50243997(CHEMBL4092937)
Affinity DataEC50:  450nM. Assay description: Agonist activity at human GPR40 expressed in CHOA12 cells assessed as induction of Ca2+ mobilization by FLIPR assay
In DepthDetails ArticlePubMed