BDBM50244030 CHEMBL4091456
SMILES C[C@H]1[C@H](CC(O)=O)N(N=C1C(F)(F)F)c1ccc(OC2CCN(CC2)c2cccc(F)n2)cc1
InChI Key InChIKey=AQJMBKJQZNFQDS-KSSFIOAISA-N
Data  1 EC50
  Tab Delimited (TSV)   2D SDfile   Computed 3D by Vconf -m prep SDfile
Find this compound or compounds like it in BindingDB:
Activity Spreadsheet -- Enzyme Inhibition Constant Data from BindingDB
Found 1 hit for monomerid = 50244030
TargetFree fatty acid receptor 1(Homo sapiens (Human))
Bristol-Myers Squibb
Curated by ChEMBL
LigandPNGBDBM50244030(CHEMBL4091456)
Affinity DataEC50:  390nM. Assay description: Agonist activity at human GPR40 expressed in CHOA12 cells assessed as induction of Ca2+ mobilization by FLIPR assay
In DepthDetails ArticlePubMed