BDBM50244071 CHEMBL4078050
SMILES C[C@H]1[C@H](CC(O)=O)N(N=C1C(F)(F)F)c1ccc(OC2CCN(CC2)c2ccccc2)cc1
InChI Key InChIKey=GKGBKNOYCODZRS-KKSFZXQISA-N
Data  1 EC50
  Tab Delimited (TSV)   2D SDfile   Computed 3D by Vconf -m prep SDfile
Find this compound or compounds like it in BindingDB:
Activity Spreadsheet -- Enzyme Inhibition Constant Data from BindingDB
Found 1 hit for monomerid = 50244071
TargetFree fatty acid receptor 1(Homo sapiens (Human))
Bristol-Myers Squibb
Curated by ChEMBL
LigandPNGBDBM50244071(CHEMBL4078050)
Affinity DataEC50:  1.93E+3nM. Assay description: Agonist activity at human GPR40 expressed in CHOA12 cells assessed as induction of Ca2+ mobilization by FLIPR assay
In DepthDetails ArticlePubMed