BDBM50244084 CHEMBL4089881
SMILES COc1ccc(F)c(c1)N1CCC(C1)Oc1ccc(cc1)N1C[C@@H](C[C@@H]1CC(O)=O)C(F)(F)F
InChI Key InChIKey=OBVSRFRVALTZDS-LSOHHRALSA-N
Data  1 EC50
  Tab Delimited (TSV)   2D SDfile   Computed 3D by Vconf -m prep SDfile
Find this compound or compounds like it in BindingDB:
Activity Spreadsheet -- Enzyme Inhibition Constant Data from BindingDB
Found 1 hit for monomerid = 50244084
TargetFree fatty acid receptor 1(Homo sapiens (Human))
Bristol-Myers Squibb
Curated by ChEMBL
LigandPNGBDBM50244084(CHEMBL4089881)
Affinity DataEC50:  2.83E+3nM. Assay description: Agonist activity at human GPR40 expressed in CHOA12 cells assessed as induction of Ca2+ mobilization by FLIPR assay
In DepthDetails ArticlePubMed