BDBM50244255 1-(4-(2-(p-toluidino)-2-oxoethoxy)-2,3-dibromo-5-ethoxybenzylidene)semicarbazide::CHEMBL470948
SMILES CCOc1cc(C=NNC(N)=O)c(Br)c(Br)c1OCC(=O)Nc1ccc(C)cc1
InChI Key InChIKey=XTENLSMPGQKYON-UHFFFAOYSA-N
Data  2 IC50
  Tab Delimited (TSV)   2D SDfile   Computed 3D by Vconf -m prep SDfile
Find this compound or compounds like it in BindingDB:
Activity Spreadsheet -- Enzyme Inhibition Constant Data from BindingDB
Found 2 hits for monomerid = 50244255
Target11-beta-hydroxysteroid dehydrogenase 1(Homo sapiens (Human))
University Of Innsbruck
Curated by ChEMBL
LigandPNGBDBM50244255(1-(4-(2-(p-toluidino)-2-oxoethoxy)-2,3-dibromo-5-e...)
Affinity DataIC50: >5.00E+4nM. Assay description: Inhibition of human recombinant 11beta-HSD1 expressed in HEK293 cell lysate assessed as conversion of radiolabeled estrone to estradiol
In DepthDetails ArticlePubMed
Target17-beta-hydroxysteroid dehydrogenase type 1(Homo sapiens (Human))
University Of Innsbruck
Curated by ChEMBL
LigandPNGBDBM50244255(1-(4-(2-(p-toluidino)-2-oxoethoxy)-2,3-dibromo-5-e...)
Affinity DataIC50:  5.70E+3nM. Assay description: Inhibition of human recombinant 17beta-HSD1 expressed in HEK293 cell lysate assessed as conversion of radiolabeled estrone to estradiol
In DepthDetails ArticlePubMed