BDBM50244765 CHEMBL4084681
SMILES CN1c2ccccc2OC[C@H](N2CCc3c(nn(Cc4ccccc4)c3C#N)C2=O)C1=O
InChI Key InChIKey=PQPOGCKQXRWTDT-FQEVSTJZSA-N
Data  1 KI
  Tab Delimited (TSV)   2D SDfile   Computed 3D by Vconf -m prep SDfile
Find this compound or compounds like it in BindingDB:
Activity Spreadsheet -- Enzyme Inhibition Constant Data from BindingDB
Found 1 hit for monomerid = 50244765
TargetReceptor-interacting serine/threonine-protein kinase 1(Homo sapiens (Human))
Takeda Pharmaceutical
Curated by ChEMBL
LigandPNGBDBM50244765(CHEMBL4084681)
Affinity DataKi:  1.10nM. Assay description: Inhibition of fluorescent-labeled 3-(3-((3-(4-amino-5-(4-(3-(2-fluoro-5-(trifluoromethyl)phenyl)ureido)-phenyl)-7H-pyrrolo[2,3-d]pyrimidin-7-yl)propy...
In DepthDetails ArticlePubMed