BDBM50245533 5-amino-3'-(2-morpholino-4-oxo-4H-chromen-8-yl)biphenyl-3-carboxylic acid::CHEMBL486876
SMILES Nc1cc(cc(c1)-c1cccc(c1)-c1cccc2c1oc(cc2=O)N1CCOCC1)C(O)=O
InChI Key InChIKey=VIXIEDYNABQQSH-UHFFFAOYSA-N
Data  1 IC50
  Tab Delimited (TSV)   2D SDfile   Computed 3D by Vconf -m prep SDfile
Find this compound or compounds like it in BindingDB:
Activity Spreadsheet -- Enzyme Inhibition Constant Data from BindingDB
Found 1 hit for monomerid = 50245533
TargetDNA-dependent protein kinase catalytic subunit(Homo sapiens (Human))
Newcastle University
Curated by ChEMBL
LigandPNGBDBM50245533(5-amino-3'-(2-morpholino-4-oxo-4H-chromen-8-yl)bip...)
Affinity DataIC50:  510nM. Assay description: Inhibition of DNA-dependent protein kinase
In DepthDetails ArticlePubMed