BDBM50245538 2-(3-chlorophenoxy)-N-(1-((2-(4-chlorophenyl)thiazol-4-yl)methyl)piperidin-4-yl)acetamide::CHEMBL488711
SMILES Clc1ccc(cc1)-c1nc(CN2CCC(CC2)NC(=O)COc2cccc(Cl)c2)cs1
InChI Key InChIKey=SHRPQTLDBVTUOB-UHFFFAOYSA-N
Data  1 IC50
  Tab Delimited (TSV)   2D SDfile   Computed 3D by Vconf -m prep SDfile
Find this compound or compounds like it in BindingDB:
Activity Spreadsheet -- Enzyme Inhibition Constant Data from BindingDB
Found 1 hit for monomerid = 50245538
TargetMelanin-concentrating hormone receptor 1(Homo sapiens (Human))
Astrazeneca R&D MöLndal
Curated by ChEMBL
LigandPNGBDBM50245538(2-(3-chlorophenoxy)-N-(1-((2-(4-chlorophenyl)thiaz...)
Affinity DataIC50:  347nM. Assay description: Displacement of [125I]MCH from human MCHR1 expressed in HEK293 cells
In DepthDetails ArticlePubMed