BDBM50245541 CHEMBL487041::N-(2-(3-chlorophenoxy)ethyl)-1-((1-(4-(trifluoromethyl)phenyl)-1H-pyrrol-3-yl)methyl)piperidin-4-amine
SMILES FC(F)(F)c1ccc(cc1)-n1ccc(CN2CCC(CC2)NCCOc2cccc(Cl)c2)c1
InChI Key InChIKey=RTDPEIGWTJIPLT-UHFFFAOYSA-N
Data  1 IC50
  Tab Delimited (TSV)   2D SDfile   Computed 3D by Vconf -m prep SDfile
Find this compound or compounds like it in BindingDB:
Activity Spreadsheet -- Enzyme Inhibition Constant Data from BindingDB
Found 1 hit for monomerid = 50245541
TargetMelanin-concentrating hormone receptor 1(Homo sapiens (Human))
Astrazeneca R&D MöLndal
Curated by ChEMBL
LigandPNGBDBM50245541(CHEMBL487041 | N-(2-(3-chlorophenoxy)ethyl)-1-((1-...)
Affinity DataIC50:  636nM. Assay description: Displacement of [125I]MCH from human MCHR1 expressed in HEK293 cells
In DepthDetails ArticlePubMed