BDBM50245557 CHEMBL488880::methyl 5-amino-3'-(2-morpholino-4-oxo-4H-chromen-8-yl)biphenyl-3-carboxylate
SMILES COC(=O)c1cc(N)cc(c1)-c1cccc(c1)-c1cccc2c1oc(cc2=O)N1CCOCC1
InChI Key InChIKey=BZWYMQWEVFHANV-UHFFFAOYSA-N
Data  1 IC50
  Tab Delimited (TSV)   2D SDfile   Computed 3D by Vconf -m prep SDfile
Find this compound or compounds like it in BindingDB:
Activity Spreadsheet -- Enzyme Inhibition Constant Data from BindingDB
Found 1 hit for monomerid = 50245557
TargetDNA-dependent protein kinase catalytic subunit(Homo sapiens (Human))
Newcastle University
Curated by ChEMBL
LigandPNGBDBM50245557(CHEMBL488880 | methyl 5-amino-3'-(2-morpholino-4-o...)
Affinity DataIC50:  260nM. Assay description: Inhibition of DNA-dependent protein kinase
In DepthDetails ArticlePubMed