BDBM50245611 CHEMBL488890::N-((1-((1-(5-tert-butylpyridin-2-yl)-1H-pyrrol-3-yl)methyl)azetidin-3-yl)methyl)-2-(m-tolyloxy)acetamide
SMILES Cc1cccc(OCC(=O)NCC2CN(Cc3ccn(c3)-c3ccc(cn3)C(C)(C)C)C2)c1
InChI Key InChIKey=RZRDGTCWTQRVAM-UHFFFAOYSA-N
Data  1 IC50
  Tab Delimited (TSV)   2D SDfile   Computed 3D by Vconf -m prep SDfile
Find this compound or compounds like it in BindingDB:
Activity Spreadsheet -- Enzyme Inhibition Constant Data from BindingDB
Found 1 hit for monomerid = 50245611
TargetMelanin-concentrating hormone receptor 1(Homo sapiens (Human))
Astrazeneca R&D MöLndal
Curated by ChEMBL
LigandPNGBDBM50245611(CHEMBL488890 | N-((1-((1-(5-tert-butylpyridin-2-yl...)
Affinity DataIC50:  169nM. Assay description: Displacement of [125I]MCH from human MCHR1 expressed in HEK293 cells
In DepthDetails ArticlePubMed