BDBM50245680 2-(3,4-difluorophenoxy)-N-((4-((1-(4-(trifluoromethyl)phenyl)-1H-pyrrol-3-yl)methyl)morpholin-2-yl)methyl)acetamide::CHEMBL453886
SMILES Fc1ccc(OCC(=O)NCC2CN(Cc3ccn(c3)-c3ccc(cc3)C(F)(F)F)CCO2)cc1F
InChI Key InChIKey=VCKDIMUQTNISDH-UHFFFAOYSA-N
Data  1 IC50
  Tab Delimited (TSV)   2D SDfile   Computed 3D by Vconf -m prep SDfile
Find this compound or compounds like it in BindingDB:
Activity Spreadsheet -- Enzyme Inhibition Constant Data from BindingDB
Found 1 hit for monomerid = 50245680
TargetMelanin-concentrating hormone receptor 1(Homo sapiens (Human))
Astrazeneca R&D MöLndal
Curated by ChEMBL
LigandPNGBDBM50245680(2-(3,4-difluorophenoxy)-N-((4-((1-(4-(trifluoromet...)
Affinity DataIC50:  269nM. Assay description: Displacement of [125I]MCH from human MCHR1 expressed in HEK293 cells
In DepthDetails ArticlePubMed