BDBM50245802 CHEMBL4099863
SMILES Cc1cc2nc(S)n(-c3cccc(c3)S(N)(=O)=O)c(=O)c2cc1C
InChI Key InChIKey=LZSXQZIFFYYUIW-UHFFFAOYSA-N
Data  4 KI
  Tab Delimited (TSV)   2D SDfile   Computed 3D by Vconf -m prep SDfile
Find this compound or compounds like it in BindingDB:
Activity Spreadsheet -- Enzyme Inhibition Constant Data from BindingDB
Found 4 hits for monomerid = 50245802
TargetCarbonic anhydrase 12(Homo sapiens (Human))
Universit£
Curated by ChEMBL
LigandPNGBDBM50245802(CHEMBL4099863)
Affinity DataKi:  9.80nM. Assay description: Inhibition of recombinant human carbonic anhydrase 12 incubated for 15 mins prior to testing by stopped flow CO2 hydration assay
In DepthDetails ArticlePubMed
TargetCarbonic anhydrase 9(Homo sapiens (Human))
Universit£
Curated by ChEMBL
LigandPNGBDBM50245802(CHEMBL4099863)
Affinity DataKi:  35nM. Assay description: Inhibition of recombinant human carbonic anhydrase 9 incubated for 15 mins prior to testing by stopped flow CO2 hydration assay
In DepthDetails ArticlePubMed
TargetCarbonic anhydrase 2(Homo sapiens (Human))
Universit£
Curated by ChEMBL
LigandPNGBDBM50245802(CHEMBL4099863)
Affinity DataKi:  210nM. Assay description: Inhibition of recombinant human carbonic anhydrase 2 incubated for 15 mins prior to testing by stopped flow CO2 hydration assay
In DepthDetails ArticlePubMed
TargetCarbonic anhydrase 1(Homo sapiens (Human))
Universit£
Curated by ChEMBL
LigandPNGBDBM50245802(CHEMBL4099863)
Affinity DataKi:  1.65E+3nM. Assay description: Inhibition of recombinant human carbonic anhydrase 1 incubated for 15 mins prior to testing by stopped flow CO2 hydration assay
In DepthDetails ArticlePubMed