BDBM50245803 CHEMBL4082241
SMILES COc1ccc2c(c1)nc(S)n(-c1cccc(c1)S(N)(=O)=O)c2=O
InChI Key InChIKey=OZBDIMCBOHSMGS-UHFFFAOYSA-N
Data  4 KI
  Tab Delimited (TSV)   2D SDfile   Computed 3D by Vconf -m prep SDfile
Find this compound or compounds like it in BindingDB:
Activity Spreadsheet -- Enzyme Inhibition Constant Data from BindingDB
Found 4 hits for monomerid = 50245803
TargetCarbonic anhydrase 12(Homo sapiens (Human))
Universit£
Curated by ChEMBL
LigandPNGBDBM50245803(CHEMBL4082241)
Affinity DataKi:  23nM. Assay description: Inhibition of recombinant human carbonic anhydrase 12 incubated for 15 mins prior to testing by stopped flow CO2 hydration assay
In DepthDetails ArticlePubMed
TargetCarbonic anhydrase 9(Homo sapiens (Human))
Universit£
Curated by ChEMBL
LigandPNGBDBM50245803(CHEMBL4082241)
Affinity DataKi:  25nM. Assay description: Inhibition of recombinant human carbonic anhydrase 9 incubated for 15 mins prior to testing by stopped flow CO2 hydration assay
In DepthDetails ArticlePubMed
TargetCarbonic anhydrase 2(Homo sapiens (Human))
Universit£
Curated by ChEMBL
LigandPNGBDBM50245803(CHEMBL4082241)
Affinity DataKi:  104nM. Assay description: Inhibition of recombinant human carbonic anhydrase 2 incubated for 15 mins prior to testing by stopped flow CO2 hydration assay
In DepthDetails ArticlePubMed
TargetCarbonic anhydrase 1(Homo sapiens (Human))
Universit£
Curated by ChEMBL
LigandPNGBDBM50245803(CHEMBL4082241)
Affinity DataKi:  7.65E+3nM. Assay description: Inhibition of recombinant human carbonic anhydrase 1 incubated for 15 mins prior to testing by stopped flow CO2 hydration assay
In DepthDetails ArticlePubMed