BDBM50245882 ((2R,3S,4R,5R,6S)-6-(4-formylphenoxy)-3,4,5-trihydroxy-tetrahydro-2H-pyran-2-yl)methyl dimethyl phosphate::CHEMBL518636
SMILES COP(=O)(OC)OC[C@H]1O[C@@H](Oc2ccc(C=O)cc2)[C@H](O)[C@H](O)[C@@H]1O
InChI Key InChIKey=XDQXDCKZWRZPHU-KJWHEZOQSA-N
Data  1 IC50
  Tab Delimited (TSV)   2D SDfile   Computed 3D by Vconf -m prep SDfile
Find this compound or compounds like it in BindingDB:
Activity Spreadsheet -- Enzyme Inhibition Constant Data from BindingDB
Found 1 hit for monomerid = 50245882
TargetPolyphenol oxidase 2(Agaricus bisporus (Common mushroom))
Sun Yat-Sen University
Curated by ChEMBL
LigandPNGBDBM50245882(((2R,3S,4R,5R,6S)-6-(4-formylphenoxy)-3,4,5-trihyd...)
Affinity DataIC50:  4.30E+5nM. Assay description: Inhibition of mushroom tyrosinase assessed as 3,4-dihydroxy-L-phenylalanine oxidation
In DepthDetails ArticlePubMed