BDBM50245926 CHEMBL462376::N-(4-(2,5-dihydroxyphenylsulfonyl)phenyl)acetamide::cid_257482
SMILES CC(=O)Nc1ccc(cc1)S(=O)(=O)c1cc(O)ccc1O
InChI Key InChIKey=OQXREQZOGOFYJC-UHFFFAOYSA-N
Data  1 IC50  1 EC50
  Tab Delimited (TSV)   2D SDfile   Computed 3D by Vconf -m prep SDfile
Find this compound or compounds like it in BindingDB:
Activity Spreadsheet -- Enzyme Inhibition Constant Data from BindingDB
Found 2 hits for monomerid = 50245926
Target3-oxoacyl-[acyl-carrier-protein] synthase 3(Mycobacterium tuberculosis)
Portland State University
Curated by ChEMBL
LigandPNGBDBM50245926(CHEMBL462376 | N-(4-(2,5-dihydroxyphenylsulfonyl)p...)
Affinity DataIC50:  31.4nM. Assay description: Inhibition of Mycobacterium tuberculosis FabH
In DepthDetails ArticlePubMed
TargetGlycogen synthase kinase-3 beta(Homo sapiens (Human))
Broad Institute
Curated by PubChem BioAssay
LigandPNGBDBM50245926(CHEMBL462376 | N-(4-(2,5-dihydroxyphenylsulfonyl)p...)
Affinity DataEC50: >3.00E+5nM. Assay description: Keywords: GSK3beta, dose response, kinase, inhibition, HTS Assay Overview: The glycogen synthase kinase-3 beta (GSK-3b) is a known master regulator f...
In DepthDetails PCBioAssay