BDBM50247011 CHEMBL4080419
SMILES Cl.CN(C)CCN(CC1CCCN(C1)C1Cc2ccccc2C1)C(=O)c1ccc2ccccc2c1
InChI Key InChIKey=JGKVRIIESWJRSI-UHFFFAOYSA-N
Data  2 KI
  Tab Delimited (TSV)   2D SDfile   Computed 3D by Vconf -m prep SDfile
Find this compound or compounds like it in BindingDB:
Activity Spreadsheet -- Enzyme Inhibition Constant Data from BindingDB
Found 2 hits for monomerid = 50247011
TargetCholinesterase(Homo sapiens (Human))
University of Ljubljana
Curated by ChEMBL
LigandPNGBDBM50247011(CHEMBL4080419)
Affinity DataKi:  0.0110nM. Assay description: Competitive inhibition of recombinant human BChE using butyrylthiocholine iodide as substrate at pH 8 by stopped flow assay
In DepthDetails ArticlePubMed
TargetCholinesterase(Homo sapiens (Human))
University of Ljubljana
Curated by ChEMBL
LigandPNGBDBM50247011(CHEMBL4080419)
Affinity DataKi:  0.0110nM. Assay description: Competitive inhibition of recombinant human BChE using butyrylthiocholine iodide as substrate at pH 8 by stopped flow assay
In DepthDetails ArticlePubMed