BDBM50248197 CCI-15641::CHEBI:3516::Ceftin::Cefuroxime Axetil::Zinnat
SMILES [H][C@]12SCC(COC(N)=O)=C(N1C(=O)[C@@]2([H])NC(=O)C(=N/OC)\c1ccco1)C(=O)OC(C)OC(C)=O
InChI Key InChIKey=KEJCWVGMRLCZQQ-YJBYXUATSA-N
Data  4 IC50
  Tab Delimited (TSV)   2D SDfile   Computed 3D by Vconf -m prep SDfile
Find this compound or compounds like it in BindingDB:
Activity Spreadsheet -- Enzyme Inhibition Constant Data from BindingDB
Found 4 hits for monomerid = 50248197
TargetBile salt export pump(Homo sapiens (Human))
Amgen
Curated by ChEMBL
LigandPNGBDBM50248197(CCI-15641 | CHEBI:3516 | Ceftin | Cefuroxime Axeti...)
Affinity DataIC50: >1.33E+5nM. Assay description: Inhibition of human BSEP overexpressed in Sf9 cell membrane vesicles assessed as uptake of [3H]-taurocholate in presence of ATP measured after 15 to ...
In DepthDetails ArticlePubMed
TargetATP-binding cassette sub-family C member 3(Homo sapiens (Human))
Amgen
Curated by ChEMBL
LigandPNGBDBM50248197(CCI-15641 | CHEBI:3516 | Ceftin | Cefuroxime Axeti...)
Affinity DataIC50: >1.33E+5nM. Assay description: Inhibition of human MRP3 overexpressed in Sf9 insect cell membrane vesicles assessed as uptake of [3H]-estradiol-17beta-D-glucuronide in presence of ...
In DepthDetails ArticlePubMed
TargetATP-binding cassette sub-family C member 4(Homo sapiens (Human))
Amgen
Curated by ChEMBL
LigandPNGBDBM50248197(CCI-15641 | CHEBI:3516 | Ceftin | Cefuroxime Axeti...)
Affinity DataIC50:  2.80E+4nM. Assay description: Inhibition of human MRP4 overexpressed in Sf9 cell membrane vesicles assessed as uptake of [3H]-estradiol-17beta-D-glucuronide in presence of ATP and...
In DepthDetails ArticlePubMed
TargetATP-binding cassette sub-family C member 2(Homo sapiens (Human))
Amgen
Curated by ChEMBL
LigandPNGBDBM50248197(CCI-15641 | CHEBI:3516 | Ceftin | Cefuroxime Axeti...)
Affinity DataIC50: >1.33E+5nM. Assay description: Inhibition of human MRP2 overexpressed in Sf9 cell membrane vesicles assessed as uptake of [3H]-estradiol-17beta-D-glucuronide in presence of ATP and...
In DepthDetails ArticlePubMed