BDBM50248255 (R)-2-(4-(2-methyl-4-(2-(pyridin-4-yl)ethyl)piperazin-1-ylsulfonyl)phenyl)propan-2-ol::CHEMBL473757
SMILES C[C@@H]1CN(CCc2ccncc2)CCN1S(=O)(=O)c1ccc(cc1)C(C)(C)O
InChI Key InChIKey=BDUQWKOASBBIJT-QGZVFWFLSA-N
Data  2 IC50
  Tab Delimited (TSV)   2D SDfile   Computed 3D by Vconf -m prep SDfile
Find this compound or compounds like it in BindingDB:
Activity Spreadsheet -- Enzyme Inhibition Constant Data from BindingDB
Found 2 hits for monomerid = 50248255
Target11-beta-hydroxysteroid dehydrogenase 1(Homo sapiens (Human))
TBA
Curated by ChEMBL
LigandPNGBDBM50248255((R)-2-(4-(2-methyl-4-(2-(pyridin-4-yl)ethyl)pipera...)
Affinity DataIC50:  5nM. Assay description: Inhibition of full length human recombinant 11beta-HSD1 expressed in baculovirus insect cell system assessed as conversion of [3H]cortisone to [3H]co...
In DepthDetails ArticlePubMed
Target11-beta-hydroxysteroid dehydrogenase 1(Homo sapiens (Human))
TBA
Curated by ChEMBL
LigandPNGBDBM50248255((R)-2-(4-(2-methyl-4-(2-(pyridin-4-yl)ethyl)pipera...)
Affinity DataIC50:  69nM. Assay description: Inhibition of full length human recombinant 11beta-HSD1 expressed in HEK293 cells in absence of NADPH
In DepthDetails ArticlePubMed