BDBM50248371 1-(4-((R)-2-methyl-4-(2-(pyridin-4-yl)ethyl)piperazin-1-ylsulfonyl)phenyl)ethanol::CHEMBL523976
SMILES CC(O)c1ccc(cc1)S(=O)(=O)N1CCN(CCc2ccncc2)C[C@H]1C
InChI Key InChIKey=ABCLLSIJJSYZCJ-TZHYSIJRSA-N
Data  2 IC50
  Tab Delimited (TSV)   2D SDfile   Computed 3D by Vconf -m prep SDfile
Find this compound or compounds like it in BindingDB:
Activity Spreadsheet -- Enzyme Inhibition Constant Data from BindingDB
Found 2 hits for monomerid = 50248371
Target11-beta-hydroxysteroid dehydrogenase 1(Homo sapiens (Human))
TBA
Curated by ChEMBL
LigandPNGBDBM50248371(1-(4-((R)-2-methyl-4-(2-(pyridin-4-yl)ethyl)pipera...)
Affinity DataIC50:  12nM. Assay description: Inhibition of full length human recombinant 11beta-HSD1 expressed in baculovirus insect cell system assessed as conversion of [3H]cortisone to [3H]co...
In DepthDetails ArticlePubMed
Target11-beta-hydroxysteroid dehydrogenase 1(Homo sapiens (Human))
TBA
Curated by ChEMBL
LigandPNGBDBM50248371(1-(4-((R)-2-methyl-4-(2-(pyridin-4-yl)ethyl)pipera...)
Affinity DataIC50:  70nM. Assay description: Inhibition of full length human recombinant 11beta-HSD1 expressed in HEK293 cells in absence of NADPH
In DepthDetails ArticlePubMed