BDBM50248373 (R)-1-(4-(1,1-difluoroethyl)phenylsulfonyl)-2-methyl-4-(2-(pyridin-4-yl)ethyl)piperazine::CHEMBL443193
SMILES C[C@@H]1CN(CCc2ccncc2)CCN1S(=O)(=O)c1ccc(cc1)C(C)(F)F
InChI Key InChIKey=ZVBJVIARCWYLQU-MRXNPFEDSA-N
Data  2 IC50
  Tab Delimited (TSV)   2D SDfile   Computed 3D by Vconf -m prep SDfile
Find this compound or compounds like it in BindingDB:
Activity Spreadsheet -- Enzyme Inhibition Constant Data from BindingDB
Found 2 hits for monomerid = 50248373
Target11-beta-hydroxysteroid dehydrogenase 1(Homo sapiens (Human))
TBA
Curated by ChEMBL
LigandPNGBDBM50248373((R)-1-(4-(1,1-difluoroethyl)phenylsulfonyl)-2-meth...)
Affinity DataIC50:  30nM. Assay description: Inhibition of full length human recombinant 11beta-HSD1 expressed in baculovirus insect cell system assessed as conversion of [3H]cortisone to [3H]co...
In DepthDetails ArticlePubMed
Target11-beta-hydroxysteroid dehydrogenase 1(Homo sapiens (Human))
TBA
Curated by ChEMBL
LigandPNGBDBM50248373((R)-1-(4-(1,1-difluoroethyl)phenylsulfonyl)-2-meth...)
Affinity DataIC50:  86nM. Assay description: Inhibition of full length human recombinant 11beta-HSD1 expressed in HEK293 cells in absence of NADPH
In DepthDetails ArticlePubMed