BDBM50248567 1-(((3R)-3-methyl-4-(4-(1,1,1-trifluoro-2-hydroxypropan-2-yl)phenylsulfonyl)piperazin-1-yl)methyl)cyclobutanecarboxamide::CHEMBL465956
SMILES C[C@@H]1CN(CC2(CCC2)C(N)=O)CCN1S(=O)(=O)c1ccc(cc1)C(C)(O)C(F)(F)F
InChI Key InChIKey=HLKTZTOQJFCERL-IKJXHCRLSA-N
Data  3 IC50
  Tab Delimited (TSV)   2D SDfile   Computed 3D by Vconf -m prep SDfile
Find this compound or compounds like it in BindingDB:
Activity Spreadsheet -- Enzyme Inhibition Constant Data from BindingDB
Found 3 hits for monomerid = 50248567
TargetPotassium voltage-gated channel subfamily H member 2(Homo sapiens (Human))
TBA
Curated by ChEMBL
LigandPNGBDBM50248567(1-(((3R)-3-methyl-4-(4-(1,1,1-trifluoro-2-hydroxyp...)
Affinity DataIC50:  6.50E+4nM. Assay description: Inhibition of human ERG by patch clamp technique
In DepthDetails ArticlePubMed
TargetCytochrome P450 3A4(Homo sapiens (Human))
TBA
Curated by ChEMBL
LigandPNGBDBM50248567(1-(((3R)-3-methyl-4-(4-(1,1,1-trifluoro-2-hydroxyp...)
Affinity DataIC50:  6.50E+4nM. Assay description: Inhibition of CYP3A4 (unknown origin)
In DepthDetails ArticlePubMed
Target11-beta-hydroxysteroid dehydrogenase 1(Homo sapiens (Human))
TBA
Curated by ChEMBL
LigandPNGBDBM50248567(1-(((3R)-3-methyl-4-(4-(1,1,1-trifluoro-2-hydroxyp...)
Affinity DataIC50:  3nM. Assay description: Inhibition of full length human recombinant 11beta-HSD1 expressed in baculovirus insect cell system assessed as conversion of [3H]cortisone to [3H]co...
In DepthDetails ArticlePubMed