BDBM502494 2,3- dichloro-N- {4-[7-(2- methoxy- ethoxy)-1- methyl- [1,2,4]tri- azolo[4,3- a]quinoxaline- 4-ylamino]-::US11028090, Example 413
SMILES COCCOc1ccc2c(c1)nc(NCCCCNC(=O)c1cccc(Cl)c1Cl)c1nnc(C)n21
InChI Key InChIKey=MPTHMDAILIZLTM-UHFFFAOYSA-N
Data  1 IC50
  Tab Delimited (TSV)   2D SDfile   Computed 3D by Vconf -m prep SDfile
Find this compound or compounds like it in BindingDB:
Activity Spreadsheet -- Enzyme Inhibition Constant Data from BindingDB
Found 1 hit for monomerid = 502494
TargetBromodomain-containing protein 4(Homo sapiens (Human))
Dong Wha Pharm.
US Patent
LigandPNGBDBM502494(2,3- dichloro-N- {4-[7-(2- methoxy- ethoxy)-1- met...)
Affinity DataIC50:  1nM. Assay description: The following experiment was performed to evaluate the ability of [1,2,4]triazolo[4,3-a]quinoxaline derivative of the present invention to inhibit th...
Ligand InfoPC cidPC sid
In DepthDetails US Patent