BDBM50249443 CHEMBL4068328
SMILES Cc1nnc2sc(C(=O)NCc3ccc(cc3)-c3ccnnc3)c(N)c2c1C
InChI Key InChIKey=LNKKGMZXHKDFEJ-UHFFFAOYSA-N
Data  2 EC50
  Tab Delimited (TSV)   2D SDfile   Computed 3D by Vconf -m prep SDfile
Find this compound or compounds like it in BindingDB:
Activity Spreadsheet -- Enzyme Inhibition Constant Data from BindingDB
Found 2 hits for monomerid = 50249443
TargetMuscarinic acetylcholine receptor M4(Homo sapiens (Human))
Vanderbilt University Medical Center
Curated by ChEMBL
LigandPNGBDBM50249443(CHEMBL4068328)
Affinity DataEC50:  56nM. Assay description: Positive allosteric modulation of human M4 receptor expressed in CHO cells coexpressing Gqi5 assessed as increase in acetylcholine-induced calcium mo...
In DepthDetails ArticlePubMed
TargetMuscarinic acetylcholine receptor M4(Homo sapiens (Human))
Vanderbilt University Medical Center
Curated by ChEMBL
LigandPNGBDBM50249443(CHEMBL4068328)
Affinity DataEC50:  55nM. Assay description: Positive allosteric modulation of human M4 receptor expressed in CHO cells coexpressing Gqi5 assessed as increase in acetylcholine-induced calcium mo...
In DepthDetails ArticlePubMed