BDBM50249469 CHEMBL4089170
SMILES Cc1ncc(cn1)-c1ccc(CNC(=O)c2sc3nnc(C)c(C)c3c2N)cc1
InChI Key InChIKey=UFPYQYMXCHYQIE-UHFFFAOYSA-N
Data  2 EC50
  Tab Delimited (TSV)   2D SDfile   Computed 3D by Vconf -m prep SDfile
Find this compound or compounds like it in BindingDB:
Activity Spreadsheet -- Enzyme Inhibition Constant Data from BindingDB
Found 2 hits for monomerid = 50249469
TargetMuscarinic acetylcholine receptor M4(Homo sapiens (Human))
Vanderbilt University Medical Center
Curated by ChEMBL
LigandPNGBDBM50249469(CHEMBL4089170)
Affinity DataEC50:  230nM. Assay description: Positive allosteric modulation of human M4 receptor expressed in CHO cells coexpressing Gqi5 assessed as increase in acetylcholine-induced calcium mo...
Ligand InfoPC cidPC sid
In DepthDetails ArticlePubMed
TargetMuscarinic acetylcholine receptor M4(Homo sapiens (Human))
Vanderbilt University Medical Center
Curated by ChEMBL
LigandPNGBDBM50249469(CHEMBL4089170)
Affinity DataEC50:  214nM. Assay description: Positive allosteric modulation of human M4 receptor expressed in CHO cells coexpressing Gqi5 assessed as increase in acetylcholine-induced calcium mo...
Ligand InfoPC cidPC sid
In DepthDetails ArticlePubMed