BDBM50249497 CHEMBL4081074
SMILES CC(C)CCC1=NOC(=O)C1
InChI Key InChIKey=PUHGVNDOQSALNB-UHFFFAOYSA-N
Data  1 IC50
  Tab Delimited (TSV)   2D SDfile   Computed 3D by Vconf -m prep SDfile
Find this compound or compounds like it in BindingDB:
Activity Spreadsheet -- Enzyme Inhibition Constant Data from BindingDB
Found 1 hit for monomerid = 50249497
TargetSortilin(Homo sapiens (Human))
Aarhus University
Curated by ChEMBL
LigandPNGBDBM50249497(CHEMBL4081074)
Affinity DataIC50:  1.26E+4nM. Assay description: Displacement of [3H]-neurotensin from human His6-tagged sortilin pretreated for 30 mins followed by [3H]-neurotensin addition after 6 hrs measured fo...
In DepthDetails ArticlePubMed