BDBM50250092 CHEMBL525957::[Tic6]PACAP38
SMILES CC[C@H](C)[C@H](NC(=O)CNC(=O)[C@H](CC(O)=O)NC(=O)[C@H](CO)NC(=O)[C@@H](N)Cc1cnc[nH]1)C(=O)N1Cc2ccccc2CC1C(=O)N[C@@H]([C@@H](C)O)C(=O)N[C@@H](CC(O)=O)C(=O)N[C@@H](CO)C(=O)N[C@@H](Cc1ccc(O)cc1)C(=O)N[C@@H](CO)C(=O)N[C@@H](CCCNC(N)=N)C(=O)N[C@@H](Cc1ccc(O)cc1)C(=O)N[C@@H](CCCNC(N)=N)C(=O)N[C@@H](CCCCN)C(=O)N[C@@H](CCC(N)=O)C(=O)N[C@@H](CCSC)C(=O)N[C@@H](C)C(=O)N[C@@H](C(C)C)C(=O)N[C@@H](CCCCN)C(=O)N[C@@H](CCCCN)C(=O)N[C@@H](Cc1ccc(O)cc1)C(=O)N[C@@H](CC(C)C)C(=O)N[C@@H](C)C(=O)N[C@@H](C)C(=O)N[C@@H](C(C)C)C(=O)N[C@@H](CC(C)C)C(=O)NCC(=O)N[C@@H](CCCCN)C(=O)N[C@@H](CCCNC(N)=N)C(=O)N[C@@H](Cc1ccc(O)cc1)C(=O)N[C@@H](CCCCN)C(=O)N[C@@H](CCC(N)=O)C(=O)N[C@@H](CCCNC(N)=N)C(=O)N[C@@H](C(C)C)C(=O)N[C@@H](CCCCN)C(=O)N[C@@H](CC(N)=O)C(=O)N[C@@H](CCCCN)C(N)=O
InChI Key InChIKey=RRAVOYYAEVZOLX-NKPJTOMSSA-N
Data  1 IC50  1 EC50
  Tab Delimited (TSV)   2D SDfile   Computed 3D by Vconf -m prep SDfile
Find this compound or compounds like it in BindingDB:
Activity Spreadsheet -- Enzyme Inhibition Constant Data from BindingDB
Found 2 hits for monomerid = 50250092
TargetPituitary adenylate cyclase-activating polypeptide type I receptor(Homo sapiens (Human))
Institut National De La Recherche Scientifique
Curated by ChEMBL
LigandPNGBDBM50250092(CHEMBL525957 | [Tic6]PACAP38)
Affinity DataIC50:  1.42E+3nM. Assay description: Displacement of [125I]Ac-PACAP27 from human recombinant PAC1 receptor expressed in CHO cells by gamma- counter
In DepthDetails ArticlePubMed
TargetPituitary adenylate cyclase-activating polypeptide type I receptor(Homo sapiens (Human))
Institut National De La Recherche Scientifique
Curated by ChEMBL
LigandPNGBDBM50250092(CHEMBL525957 | [Tic6]PACAP38)
Affinity DataEC50:  4.01E+3nM. Assay description: Agonist activity at human recombinant PAC1 receptor expressed in CHO cells assessed as PACAP38-induced calcium mobilization by FLIPR assay
In DepthDetails ArticlePubMed