BDBM50250539 CHEMBL4088715
SMILES [O-][S+](Cc1ccsc1Br)C(c1ccccc1)c1ccccc1
InChI Key InChIKey=GMAKYKKEJKPVHM-UHFFFAOYSA-N
Data  3 IC50
  Tab Delimited (TSV)   2D SDfile   Computed 3D by Vconf -m prep SDfile
Find this compound or compounds like it in BindingDB:
Activity Spreadsheet -- Enzyme Inhibition Constant Data from BindingDB
Found 3 hits for monomerid = 50250539
TargetSodium-dependent serotonin transporter(Homo sapiens (Human))
University Of Vienna
Curated by ChEMBL
LigandPNGBDBM50250539(CHEMBL4088715)
Affinity DataIC50:  5.96E+4nM. Assay description: Inhibition of re-uptake of [3H]-5-HT at human SERT expressed in HEK293 cells preincubated for 5 mins followed by [3H]-dopamine addition measured afte...
In DepthDetails ArticlePubMed
TargetSodium-dependent dopamine transporter(Homo sapiens (Human))
University Of Vienna
Curated by ChEMBL
LigandPNGBDBM50250539(CHEMBL4088715)
Affinity DataIC50:  2.93E+4nM. Assay description: Inhibition of re-uptake of [3H]-dopamine at human DAT expressed in HEK293 cells preincubated for 5 mins followed by [3H]-dopamine addition measured a...
In DepthDetails ArticlePubMed
TargetSodium-dependent noradrenaline transporter(Homo sapiens (Human))
University Of Vienna
Curated by ChEMBL
LigandPNGBDBM50250539(CHEMBL4088715)
Affinity DataIC50:  1.44E+5nM. Assay description: Inhibition of re-uptake of [3H]MPP+ at human NET expressed in HEK293 cells preincubated for 5 mins followed by [3H]-dopamine addition measured after ...
In DepthDetails ArticlePubMed