BDBM50250594 CHEMBL4092285
SMILES OC(c1cccc(c1)-c1ccc(cc1)C(F)(F)P(O)(O)=O)c1cc(Cl)c(Cl)cc1Cl
InChI Key InChIKey=KTDPTFVUKGPLGJ-UHFFFAOYSA-N
Data  1 KI
  Tab Delimited (TSV)   2D SDfile   Computed 3D by Vconf -m prep SDfile
Find this compound or compounds like it in BindingDB:
Activity Spreadsheet -- Enzyme Inhibition Constant Data from BindingDB
Found 1 hit for monomerid = 50250594
TargetTyrosine-protein phosphatase non-receptor type 5(Homo sapiens (Human))
Yale University
Curated by ChEMBL
LigandPNGBDBM50250594(CHEMBL4092285)
Affinity DataKi:  1.00E+4nM. Assay description: Inhibition of STEP (unknown origin) using pNPP as substrate preincubated for 5 mins followed by substrate addition measured for 20 mins by spectropho...
In DepthDetails ArticlePubMed