BDBM50250709 CHEMBL4076358
SMILES C[C@H](NC(=O)[C@H](CCCNC(N)=N)NC(C)=O)C(=O)N[C@@H]1CSSC(C)(C)[C@H](NC(=O)[C@H](Cc2cnc[nH]2)NC(=O)[C@H](Cc2ccccc2)NC(=O)[C@H](CCCNC(N)=N)NC1=O)C(O)=O
InChI Key InChIKey=YDVQMUVDNHBIMG-XPOKGGDFSA-N
Data  1 IC50
  Tab Delimited (TSV)   2D SDfile   Computed 3D by Vconf -m prep SDfile
Find this compound or compounds like it in BindingDB:
Activity Spreadsheet -- Enzyme Inhibition Constant Data from BindingDB
Found 1 hit for monomerid = 50250709
TargetC-X-C chemokine receptor type 4(Homo sapiens (Human))
University Of Campania
Curated by ChEMBL
LigandPNGBDBM50250709(CHEMBL4076358)
Affinity DataIC50:  360nM. Assay description: Inhibition of anti-CXCR4 PE antibody clone 12G5 binding to CXCR4 in human CCRF-CEM cells preincubated for 30 mins followed by anti-CXCR4 PE antibody ...
In DepthDetails ArticlePubMed