BDBM50250712 CHEMBL446297::Integracide A
SMILES CC(C)C(=C)CC[C@@H](C)[C@H]1CC=C2C3=C([C@@H](O)[C@H](OC(C)=O)[C@]12C)[C@@]1(C)C[C@@H](O)[C@H](OS(O)(=O)=O)C(C)(C)[C@@H]1CC3
InChI Key InChIKey=BGABDSBXSCYPTK-PGHPLGCHSA-N
Data  1 IC50
  Tab Delimited (TSV)   2D SDfile   Computed 3D by Vconf -m prep SDfile
Find this compound or compounds like it in BindingDB:
Activity Spreadsheet -- Enzyme Inhibition Constant Data from BindingDB
Found 1 hit for monomerid = 50250712
TargetType II restriction enzyme EcoRI(Escherichia coli)
Merck Research Laboratories
Curated by ChEMBL
LigandPNGBDBM50250712(CHEMBL446297 | Integracide A)
Affinity DataIC50: >5.00E+4nM. Assay description: Inhibition of Escherichia coli ECOR1
In DepthDetails ArticlePubMed