BDBM50250715 (2R,3R,5R,10S,11R,12R,13R,17R)-12-acetoxy-11-hydroxy-17-((2R)-4-(2-(2-hydroxypropan-2-yl)oxiran-2-yl)butan-2-yl)-4,4,10,13-tetramethyl-3-(sulfooxy)-2,3,4,5,6,7,10,11,12,13,16,17-dodecahydro-1H-cyclopenta[a]phenanthren-2-yl 16-hydroxyhexadecanoate::CHEMBL501254
SMILES C[C@H](CCC1(CO1)C(C)(C)O)[C@H]1CC=C2C3=C([C@@H](O)[C@H](OC(C)=O)[C@]12C)[C@@]1(C)C[C@@H](OC(=O)CCCCCCCCCCCCCCCO)[C@H](OS(O)(=O)=O)C(C)(C)[C@@H]1CC3
InChI Key InChIKey=LGHUFCYDBTXXCS-UHODCKRESA-N
Data  1 IC50
  Tab Delimited (TSV)   2D SDfile   Computed 3D by Vconf -m prep SDfile
Find this compound or compounds like it in BindingDB:
Activity Spreadsheet -- Enzyme Inhibition Constant Data from BindingDB
Found 1 hit for monomerid = 50250715
TargetType II restriction enzyme EcoRI(Escherichia coli)
Merck Research Laboratories
Curated by ChEMBL
LigandPNGBDBM50250715((2R,3R,5R,10S,11R,12R,13R,17R)-12-acetoxy-11-hydro...)
Affinity DataIC50: >5.00E+4nM. Assay description: Inhibition of Escherichia coli ECOR1
In DepthDetails ArticlePubMed