BDBM50250717 (3S,5R,10S,11R,12R,13R,17R)-11-hydroxy-4,4,10,13-tetramethyl-17-((R)-6-methyl-5-methyleneheptan-2-yl)-3-(sulfooxy)-2,3,4,5,6,7,10,11,12,13,16,17-dodecahydro-1H-cyclopenta[a]phenanthren-12-yl acetate::CHEMBL453488
SMILES CC(C)C(=C)CC[C@@H](C)[C@H]1CC=C2C3=C([C@@H](O)[C@H](OC(C)=O)[C@]12C)[C@@]1(C)CC[C@H](OS(O)(=O)=O)C(C)(C)[C@@H]1CC3
InChI Key InChIKey=YIZOZMCCRSCPMN-OOPROCISSA-N
Data  1 IC50
  Tab Delimited (TSV)   2D SDfile   Computed 3D by Vconf -m prep SDfile
Find this compound or compounds like it in BindingDB:
Activity Spreadsheet -- Enzyme Inhibition Constant Data from BindingDB
Found 1 hit for monomerid = 50250717
TargetType II restriction enzyme EcoRI(Escherichia coli)
Merck Research Laboratories
Curated by ChEMBL
LigandPNGBDBM50250717((3S,5R,10S,11R,12R,13R,17R)-11-hydroxy-4,4,10,13-t...)
Affinity DataIC50: >5.00E+4nM. Assay description: Inhibition of Escherichia coli ECOR1
In DepthDetails ArticlePubMed