BDBM50251671 CHEMBL4097725
SMILES Clc1ccc2c(c1)oc(=O)c1c3C(=O)C=CC(=O)c3ccc21
InChI Key InChIKey=SMUFAVRUIRRBBA-UHFFFAOYSA-N
Data  2 IC50
  Tab Delimited (TSV)   2D SDfile   Computed 3D by Vconf -m prep SDfile
Find this compound or compounds like it in BindingDB:
Activity Spreadsheet -- Enzyme Inhibition Constant Data from BindingDB
Found 2 hits for monomerid = 50251671
TargetM-phase inducer phosphatase 3(Homo sapiens (Human))
Sapienza University of Rome
Curated by ChEMBL
LigandPNGBDBM50251671(CHEMBL4097725)
Affinity DataIC50:  770nM. Assay description: Inhibition of recombinant human full length GST-tagged CDC25C expressed in Escherichia coli BL21-DE3 pLysS using 3-O-methylfluorescein phosphate as s...
In DepthDetails ArticlePubMed
TargetM-phase inducer phosphatase 1(Homo sapiens (Human))
Sapienza University of Rome
Curated by ChEMBL
LigandPNGBDBM50251671(CHEMBL4097725)
Affinity DataIC50:  1.61E+3nM. Assay description: Inhibition of recombinant human full length GST-tagged CDC25A expressed in Escherichia coli BL21-DE3 pLysS using 3-O-methylfluorescein phosphate as s...
In DepthDetails ArticlePubMed